JOBNO,SOILPIT,BORING,HORIZON,TOPSOIL,TEXTURE,TCLASS,COLOUR,TOPDEPTH,BTMDEPTH,CACO3,STONE2,STONE6,TOTSTONE,LITH,MOTCOL,MOTABUND,MOTCONT,PEDCOL,GLEYED,STRUCTURE,CONSIST,SUBSSTR,POROSITY,IMPEN,SPL,COMMENTS
395,,49,1,Y,mzcl,3,25Y 52 00,0,28,,0,0,5,HR,75YR46 00,M,,,Y,,,,,,,
395,,49,2,,hcl,4,10YR53 00,28,38,,0,0,5,HR,75YR58 00,C,,,Y,,,M,,,,
395,,49,3,,c,5,10YR63 00,38,70,,0,0,2,HR,75YR58 00,C,,,Y,,,P,Y,,Y,
395,,45,1,Y,mcl,3,10YR53 00,0,28,,1,0,2,HR,10YR58 00,F,,,,,,,,,,
395,,45,2,,mcl,3,25Y 63 00,28,45,,0,0,2,HR,75YR46 00,C,,00MN00 00,Y,,,M,,,,
395,,45,3,,c,5,10YR72 00,45,70,,0,0,1,HR,75YR58 00,M,,,Y,,,P,Y,,Y,
395,,48,1,Y,mcl,3,25Y 52 00,0,30,,3,0,6,HR,1OYR58 00,F,,,,,,,,,,
395,,48,2,,c,5,25Y 72 00,30,60,,0,0,2,HR,75YR58 00,M,,,Y,,,P,Y,,Y,
395,,43,1,Y,mcl,3,10YR53 00,0,30,,2,0,3,HR,10YR58 00,F,,,,,,,,,,
395,,43,2,,mcl,3,25Y 63 00,30,45,,0,0,2,HR,75YR46 00,C,,00MN00 00,Y,,,M,,,,
395,,43,3,,c,5,10YR72 00,45,70,,0,0,1,HR,75YR58 00,M,,,Y,,,P,Y,,Y,
395,,47,1,Y,hcl,4,25Y 61 00,0,20,,0,0,2,HR,75YR46 00,C,,,Y,,,,,,,
395,,47,2,,hcl,4,25Y 71 00,20,60,,0,0,2,HR,75YR46 00,M,,,Y,,,P,Y,,Y,
395,,56,1,Y,mcl,3,25Y 52 00,0,30,,6,0,8,HR,10YR58 00,F,,,,,,,,,,
395,,56,2,,hcl,4,25Y 73 00,30,40,,0,0,20,HR,75YR46 00,C,,00MN00 00,Y,,,M,,,,
395,,56,3,,c,5,25Y 61 00,40,60,,0,0,5,HR,75YR58 00,M,,,Y,,,P,Y,,Y,
395,,58,1,Y,mcl,3,25Y 52 00,0,30,,0,0,5,HR,10YR58 00,F,,,,,,,,,,
395,,58,2,,hcl,4,25Y 61 00,30,50,,0,0,5,HR,75YR58 00,M,,,Y,,,P,Y,,Y,See 1P
395,,58,3,,c,5,25Y 71 00,50,70,,0,0,2,HR,75YR58 00,M,,,Y,,,P,Y,,Y,
395,,57,1,Y,mcl,3,25Y 42 00,0,30,,0,0,5,HR,75YR46 00,C,,,Y,,,,,,,
395,,57,2,,c,5,25Y 73 00,30,60,,0,0,10,HR,75YR46 00,M,,00MN00 00,Y,,,P,Y,,Y,
395,,59,1,Y,zl,3,10YR52 00,0,30,,0,0,5,HR,10YR58 00,F,,,,,,,,,,
395,,59,2,,fszl,2,25Y 71 00,30,45,,0,0,8,HR,10YR58 00,C,,,Y,,,M,,,,
395,,59,3,,mzcl,3,25Y 72 00,45,55,,0,0,2,HR,10YR58 00,C,,,Y,,,M,,,,
395,,59,4,,c,5,25Y 61 00,55,75,,0,0,2,HR,75YR58 00,M,,,Y,,,P,Y,,Y,
395,,1P,1,Y,fszl,2,25Y 42 00,0,28,,6,0,10,HR,75YR46 00,C,,,Y,,,,,,,hand texd zl
395,,1P,2,,mcl,3,25Y 63 62,28,50,,0,0,6,HR,75YR58 00,M,,,Y,WKCSAB,FR,P,Y,,Y,hand texd hzcl
395,,1P,3,,c,5,25Y 71 00,50,75,,0,0,2,HR,75YR58 00,M,,,Y,MASSVE,FM,P,Y,,Y,
395,,19,1,Y,mzcl,3,10YR42 00,0,30,,0,0,0,,,,,,,,,,,,,
395,,19,2,,c,5,10YR52 00,30,40,,0,0,0,,00OC00 00,C,,,Y,,,M,,,,
395,,19,3,,c,5,25Y 52 00,40,60,,0,0,1,HR,00OC00 00,M,,,Y,,,P,Y,,Y,
395,,8,1,Y,hcl,4,10YR42 00,0,25,,0,0,0,,00OC00 00,C,,,Y,,,,,,,
395,,8,2,,c,5,25Y 52 00,25,35,,0,0,0,,00OC00 00,C,,,Y,,,M,,,,
395,,8,3,,c,5,25Y 52 00,35,60,,0,0,0,,00OC00 00,M,,,Y,,,P,Y,,Y,
395,,18,1,Y,mzcl,3,10YR42 00,0,25,,0,0,0,,,,,,,,,,,,,
395,,18,2,,c,5,10YR53 00,25,38,,0,0,0,,00OC00 00,C,,,Y,,,M,,,,
395,,18,3,,c,5,10YR53 00,38,60,,0,0,0,,00OC00 00,M,,,Y,,,P,Y,,Y,
395,,17,1,Y,mzcl,3,10YR42 00,0,25,,0,0,0,,,,,,,,,,,,,
395,,17,2,,c,5,10YR53 00,25,38,,0,0,0,,00OC00 00,C,,,Y,,,M,,,,
395,,17,3,,c,5,25Y 52 00,38,60,,0,0,1,HR,00OC00 00,M,,,Y,,,P,Y,,Y,
395,,28,1,Y,mcl,3,10YR42 00,0,20,,6,0,8,HR,,,,,,,,,,,,
395,,28,2,,mcl,3,10YR53 00,20,40,,0,0,10,HR,00OC00 00,C,,,Y,,,M,,,,
395,,28,3,,c,5,25Y 52 00,40,60,,0,0,2,HR,00OC00 00,M,,,Y,,,P,Y,,Y,
395,,16,1,Y,mcl,3,10YR42 00,0,25,,0,0,0,,,,,,,,,,,,,
395,,16,2,,hcl,4,10YR53 00,25,38,,0,0,0,,00OC00 00,C,,,Y,,,M,,,,
395,,16,3,,c,5,10YR53 00,38,60,,0,0,0,,00OC00 00,C,,,Y,,,P,Y,,Y,
395,,5,1,Y,hcl,4,10YR42 00,0,30,,0,0,0,,,,,,,,,,,,,
395,,5,2,,c,5,10YR53 00,30,35,,0,0,0,,00OC00 00,C,,,Y,,,M,,,,
395,,5,3,,c,5,25Y 52 00,35,55,,0,0,0,,00OC00 00,M,,,Y,,,P,Y,,Y,
395,,6,1,Y,mzcl,3,10YR42 00,0,25,,0,0,0,,,,,,,,,,,,,
395,,6,2,,c,5,10YR53 00,25,35,,0,0,0,,00OC00 00,C,,,Y,,,M,,,,
395,,6,3,,c,5,25Y 52 00,35,60,,0,0,0,,00OC00 00,M,,,Y,,,P,Y,,Y,
395,,7,1,Y,mzcl,3,10YR42 00,0,25,,0,0,2,HR,,,,,,,,,,,,
395,,7,2,,hcl,4,10YR53 00,25,38,,0,0,2,HR,00OC00 00,C,,,Y,,,M,,,,
395,,7,3,,c,5,25Y 52 00,38,60,,0,0,0,,00OC00 00,M,,,Y,,,P,Y,,Y,
395,,9,1,Y,mzcl,3,10YR42 00,0,25,,0,0,2,HR,,,,,,,,,,,,
395,,9,2,,hcl,4,10YR53 00,25,35,,0,0,2,HR,00OC00 00,C,,,Y,,,M,,,,
395,,9,3,,c,5,25Y 52 00,35,60,,0,0,0,,00OC00 00,M,,,Y,,,P,Y,,Y,
395,,20,1,Y,hzcl,4,10YR42 00,0,28,,0,0,0,,,,,,,,,,,,,
395,,20,2,,c,5,10YR53 00,28,55,,0,0,0,,00OC00 00,C,,,Y,,,P,Y,,,
395,,10,1,Y,hcl,4,10YR42 00,0,25,,0,0,0,,,,,,,,,,,,,
395,,10,2,,c,5,10YR53 00,25,35,,0,0,0,,00OC00 00,C,,,Y,,,M,,,,
395,,10,3,,c,5,25Y 52 00,35,55,,0,0,0,,00OC00 00,M,,,Y,,,P,Y,,Y,
395,,11,1,Y,mcl,3,10YR42 00,0,25,,0,0,1,HR,,,,,,,,,,,,
395,,11,2,,c,5,10YR53 00,25,35,,0,0,1,HR,00OC00 00,C,,,Y,,,M,,,,
395,,11,3,,c,5,25Y 52 00,35,55,,0,0,0,,00OC00 00,M,,,Y,,,P,Y,,Y,
395,,1,1,Y,mcl,3,10YR42 00,0,25,,0,0,2,HR,,,,,,,,,,,,
395,,1,2,,c,5,10YR53 00,25,38,,0,0,0,,00OC00 00,C,,,Y,,,M,,,,
395,,1,3,,c,5,10YR53 00,38,55,,0,0,0,,00OC00 00,M,,,Y,,,P,Y,,Y,
395,,2,1,Y,mcl,3,10YR42 00,0,25,,0,0,2,HR,,,,,,,,,,,,
395,,2,2,,hcl,4,10YR53 00,25,35,,0,0,0,,00OC00 00,C,,,Y,,,M,,,,
395,,2,3,,c,5,25Y 52 00,35,55,,0,0,0,,00OC00 00,M,,,Y,,,P,Y,,Y,
395,,3,1,Y,c,5,10YR52 00,0,28,,0,0,0,,,,,,,,,,,,,
395,,3,2,,c,5,10YR51 00,28,50,,0,0,0,,00OC00 00,M,,,Y,,,P,Y,,Y,
395,,12,1,Y,mcl,3,10YR42 00,0,25,,2,0,8,HR,,,,,,,,,,,,
395,,12,2,,hcl,4,10YR53 00,25,38,,0,0,10,HR,00OC00 00,C,,,Y,,,M,,,,
395,,12,3,,c,5,25Y 63 00,38,60,,0,0,2,HR,00OC00 00,M,,,Y,,,P,Y,,Y,Imp flints
395,,14,1,Y,mcl,3,10YR42 00,0,25,,3,0,10,HR,,,,,,,,,,,,
395,,14,2,,hcl,4,10YR53 00,25,40,,0,0,15,HR,00OC00 00,C,,,Y,,,M,,,,Imp flints
395,,37,1,Y,hcl,4,10YR32 00,0,25,,0,0,2,HR,,,,,,,,,,,,
395,,37,2,,c,5,10YR41 00,25,55,,0,0,0,,00OC00 00,C,,,Y,,,P,Y,,Y,
395,,50,1,Y,mcl,3,10YR52 00,0,28,,0,0,2,HR,,,,,,,,,,,,
395,,50,2,,hcl,4,10YR53 00,28,38,,0,0,2,HR,,,,,,,,M,,,,
395,,50,3,,c,5,10YR53 00,38,55,,0,0,0,,00OC00 00,M,,,Y,,,P,Y,,Y,
395,,60,1,Y,mcl,3,10YR42 00,0,28,,0,0,2,HR,,,,,,,,,,,,
395,,60,2,,hcl,4,10YR53 00,28,42,,0,0,2,HR,00OC00 00,C,,,Y,,,M,,,,
395,,60,3,,c,5,10YR53 00,42,60,,0,0,0,,00OC00 00,M,,,Y,,,P,Y,,Y,
395,,29,1,Y,mzcl,3,10YR43 00,0,25,,0,0,3,HR,,,,,,,,,,,,
395,,29,2,,c,5,10YR52 00,25,55,,0,0,3,HR,10YR68 72,C,,,Y,,,P,,,Y,
395,,29,3,,c,5,10YR52 00,55,70,,0,0,20,HR,10YR68 72,C,,,Y,,,P,,,Y,Imp flints
395,,30,1,Y,mzcl,3,10YR42 00,0,20,,0,0,2,HR,10,,,,,,,,,,,
395,,30,2,,hzcl,4,10YR42 00,20,30,,0,0,0,,10YR68 61,C,,,Y,,,P,,,Y,
395,,30,3,,c,5,25Y 62 00,30,70,,0,0,0,,10YR68 71,C,,,Y,,,P,,,Y,
395,,31,1,Y,mcl,3,10YR41 42,0,22,,0,0,3,HR,10YR58 00,C,,,Y,,,,,,,
395,,31,2,,hcl,4,10YR52 00,22,40,,0,0,5,HR,10YR68 61,C,,,Y,,,P,,,Y,
395,,31,3,,c,5,10YR62 63,40,65,,0,0,5,HR,10YR68 61,C,,,Y,,,P,,,Y,
395,,32,1,Y,mcl,3,10YR42 43,0,22,,0,0,2,HR,,,,,,,,,,,,
395,,32,2,,mcl,3,10YR52 00,22,42,,0,0,5,HR,10YR58 00,C,,,Y,,,M,,,,
395,,32,3,,c,5,10YR62 00,42,70,,0,0,0,,10YR68 61,C,,,Y,,,P,,,Y,
395,,33,1,Y,mcl,3,10YR43 00,0,24,,0,0,3,HR,,,,,,,,,,,,
395,,33,2,,hcl,4,10YR52 00,24,38,,0,0,3,HR,10YR58 00,C,,,Y,,,M,,,,
395,,33,3,,c,5,10YR62 00,38,70,,0,0,0,,75YR68 62,C,,,Y,,,P,,,Y,
395,,22,1,Y,mcl,3,10YR41 42,0,26,,0,0,3,HR,10YR56 00,C,,,Y,,,,,,,
395,,22,2,,c,5,10YR62 00,26,60,,0,0,8,HR,10YR68 61,C,,,Y,,,P,,,Y,
395,,21,1,Y,mcl,3,10YR42 00,0,24,,8,0,10,HR,,,,,,,,,,,,
395,,21,2,,c,5,10YR61 00,24,50,,0,0,10,HR,10YR68 62,C,,,Y,,,P,,,Y,
395,,21,3,,c,5,10YR61 00,50,60,,0,0,20,HR,10YR68 62,C,,,Y,,,P,,,Y,
395,,13,1,Y,msl,2,10YR42 00,0,25,,8,0,10,HR,,,,,,,,,,,,
395,,13,2,,mcl,3,10YR52 00,25,30,,0,0,10,HR,10YR58 00,C,,,Y,,,M,,,,Imp flints
395,,23,1,Y,mcl,3,10YR41 42,0,28,,0,0,2,HR,10YR56 00,C,,,Y,,,,,,,
395,,23,2,,c,5,10YR52 51,28,60,,0,0,0,,10YR68 00,C,,,Y,,,P,,,Y,
395,,34,1,Y,mcl,3,10YR43 00,0,25,,0,0,3,HR,,,,,,,,,,,,
395,,34,2,,mcl,3,10YR52 00,25,40,,0,0,5,HR,10YR58 00,C,,,Y,,,M,,,,
395,,34,3,,c,5,10YR62 00,40,50,,0,0,10,HR,10YR68 61,C,,,Y,,,P,,,Y,
395,,34,4,,c,5,10YR62 00,50,70,,0,0,0,,10YR68 61,C,,,Y,,,P,,,Y,
395,,35,1,Y,mcl,3,10YR42 00,0,28,,0,0,3,HR,10YR56 00,C,,,Y,,,,,,,
395,,35,2,,mcl,3,10YR52 00,28,35,,0,0,5,HR,10YR58 00,C,,,Y,,,M,,,,
395,,35,3,,c,5,10YR62 00,35,65,,0,0,20,HR,10YR68 61,C,,,Y,,,P,,,,
395,,36,1,Y,mcl,3,10YR42 00,0,22,,0,0,2,HR,10YR56 00,F,,,,,,,,,,
395,,36,2,,hcl,4,10YR42 41,22,38,,0,0,0,,10YR58 00,C,,,Y,,,M,,,,
395,,36,3,,c,5,05Y 31 00,38,60,,0,0,0,,10YR58 00,C,,00MN00 00,Y,,,P,,,Y,
395,,38,1,Y,mcl,3,10YR42 00,0,25,,6,0,8,HR,,,,,,,,,,,,
395,,38,2,,mcl,3,10YR42 44,25,55,,0,0,10,HR,00MN00 00,C,,,,,,M,,,,
395,,38,3,,scl,3,10YR53 00,55,75,,0,0,25,HR,10YR68 61,C,,,Y,,,M,,,,
395,,38,4,,c,5,10YR62 00,75,100,,0,0,20,HR,10YR68 61,C,,,Y,,,P,,,Y,Imp flints
395,,24,1,Y,mcl,3,10YR42 00,0,26,,6,0,8,HR,,,,,,,,,,,,
395,,24,2,,hcl,4,10YR52 00,26,37,,0,0,10,HR,10YR58 00,C,,,Y,,,M,,,,
395,,24,3,,c,5,10YR62 00,37,60,,0,0,3,HR,10YR68 61,C,,,Y,,,P,,,Y,
395,,39,1,Y,mcl,3,10YR42 00,0,24,,0,0,2,HR,10YR58 61,C,,,Y,,,,,,,
395,,39,2,,mcl,3,10YR52 00,24,38,,0,0,0,,10YR58 61,C,,,Y,,,M,,,,
395,,39,3,,c,5,10YR62 00,38,60,,0,0,0,,10YR68 61,C,,,Y,,,P,,,Y,
395,,53,1,Y,msl,2,10YR42 43,0,24,,0,0,0,,,,,,,,,,,,,
395,,53,2,,msl,2,10YR44 00,24,45,,0,0,5,HR,,,,,,,,M,,,,
395,,53,3,,msl,2,10YR54 00,45,80,,0,0,5,HR,,,,,,,,M,,,,
395,,53,4,,scl,3,10YR62 63,80,120,,0,0,0,,10YR68 00,C,,25YR46 00,Y,,,M,,,,
395,,52,1,Y,msl,2,10YR42 00,0,27,,0,0,2,HR,,,,,,,,,,,,
395,,52,2,,msl,2,10YR53 00,27,60,,0,0,0,,,,,,,,,M,,,,
395,,52,3,,lms,1,10YR54 00,60,120,,0,0,0,,10YR68 00,C,,,S,,,M,,,,
395,,51,1,Y,mcl,3,10YR42 00,0,27,,0,0,0,,,,,,,,,,,,,
395,,51,2,,mcl,3,10YR52 53,27,45,,0,0,0,,10YR56 00,C,,,Y,,,M,,,,
395,,51,3,,c,5,10YR62 00,45,70,,0,0,0,,10YR68 61,C,,,Y,,,P,,,Y,
395,,42,1,Y,c,5,10YR52 00,0,25,,0,0,1,HR,75YR58 00,M,,,Y,,,,,,,
395,,42,2,,c,5,25Y 62 00,25,55,,0,0,2,HR,75YR58 00,M,,,Y,,,P,Y,,Y,
395,,44,1,Y,mzcl,3,10YR42 00,0,25,,2,0,3,HR,,,,,,,,,,,,
395,,44,2,,c,5,25Y 62 00,25,60,,0,0,0,HR,75YR58 00,M,,,Y,,,P,Y,,Y,
395,,15,1,Y,mcl,3,10YR42 00,0,28,,0,0,2,HR,,,,,,,,,,,,
395,,15,2,,hcl,4,10YR53 00,28,38,,0,0,5,HR,00OC00 00,C,,,Y,,,M,,,,
395,,15,3,,c,5,25Y 52 00,38,60,,0,0,2,HR,00OC00 00,M,,,Y,,,P,Y,,Y,
395,,4,1,Y,mcl,3,10YR42 00,0,30,,0,0,2,HR,,,,,,,,,,,,
395,,4,2,,hcl,4,10YR53 00,30,40,,0,0,2,HR,00OC00 00,C,,,Y,,,M,,,,
395,,4,3,,c,5,10YR53 00,40,60,,0,0,2,HR,00OC00 00,M,,,Y,,,P,Y,,Y,
395,,26,1,Y,hcl,4,10YR42 00,0,25,,0,0,2,HR,,,,,,,,,,,,
395,,26,2,,c,5,10YR53 00,25,35,,0,0,2,HR,00OC00 00,C,,,Y,,,M,,,,
395,,26,3,,c,5,25Y 52 00,35,60,,0,0,0,,00OC00 00,M,,,Y,,,P,Y,,Y,
395,,54,1,Y,msl,2,10YR42 00,0,27,,0,0,3,HR,10YR56 00,F,,,,,,,,,,
395,,54,2,,msl,2,10YR54 43,27,45,,0,0,10,HR,10YR56 00,C,,,S,,,M,,,,
395,,54,3,,lms,1,10YR63 00,45,120,,0,0,5,HR,10YR58 72,C,,,Y,,,M,,,,
395,,55,1,Y,msl,2,10YR43 00,0,30,,0,0,3,HR,,,,,,,,,,,,
395,,55,2,,msl,2,10YR43 00,30,35,,0,0,3,HR,10YR56 00,F,,,,,,M,,,,
395,,55,3,,lms,1,10YR54 00,35,60,,0,0,5,HR,,,,,,,,G,,,,See 2P
395,,55,4,,lms,1,10YR54 00,60,85,,0,0,0,,10YR68 73,C,,,S,,,G,,,,See 2P
395,,55,5,,scl,3,10YR54 00,85,120,,0,0,0,,10YR68 73,C,,,S,,,M,,,,
395,,46,1,Y,msl,2,10YR43 00,0,30,,0,0,2,HR,,,,,,,,,,,,
395,,46,2,,msl,2,10YR53 00,30,40,,0,0,0,,,,,,,,,M,,,,
395,,46,3,,msl,2,10YR63 00,40,60,,0,0,0,,10YR58 00,C,,,Y,,,M,,,,WT at 55
395,,46,4,,msl,2,10YR62 00,60,80,,0,0,0,,10YR68 00,C,,,Y,,,M,,,,Imp flints
395,,2P,1,Y,fsl,2,10YR42 00,0,30,,6,0,8,HR,,,,,,,,,,,,hand texd msl
395,,2P,2,,msl,2,10YR53 00,30,50,,0,0,18,HR,10YR56 00,C,,,Y,MDCSAB,FR,M,,,,
395,,2P,3,,lms,1,10YR62 53,50,90,,0,0,10,HR,10YR68 72,M,,,Y,MDCSAB,FR,G,,,,
395,,2P,4,,msl,2,10YR54 00,90,120,,0,0,15,HR,10YR68 72,M,,,S,,,M,,,,
395,,27,1,Y,mcl,3,10YR52 00,0,30,,6,0,8,HR,75YR58 00,C,,,Y,,,,,,,
395,,27,2,,mcl,3,25Y 63 00,30,35,,0,0,4,HR,75YR58 00,M,,,Y,,,M,,,,
395,,27,3,,c,5,25Y 62 00,35,60,,0,0,2,HR,75YR58 00,M,,,Y,,,P,,,Y,
395,,40,1,Y,mcl,3,10YR52 00,0,28,,2,0,6,HR,75YR58 00,C,,,Y,,,,,,,
395,,40,2,,hcl,4,25Y 63 00,28,50,,0,0,4,HR,75YR58 00,C,,,Y,,,M,,,,
395,,40,3,,c,5,25Y 62 00,50,70,,0,0,2,HR,75YR58 00,M,,,Y,,,P,Y,,Y,
395,,25,1,Y,mzcl,3,10YR52 00,0,30,,2,0,6,HR,75YR58 00,C,,,Y,,,,,,,
395,,25,2,,hcl,4,10YR53 00,30,80,,0,0,6,HR,10YR58 00,C,,,Y,,,M,,,,
395,,25,3,,c,5,25Y 72 00,80,120,,0,0,2,HR,75YR58 00,M,,,Y,,,P,Y,,Y,
395,,41,1,Y,mcl,3,10YR52 00,0,28,,0,0,2,HR,10YR58 00,C,,,Y,,,,,,,
395,,41,2,,c,5,25Y 62 00,28,60,,0,0,0,,75YR38 00,M,,,Y,,,P,Y,,Y,
